Target
5-lipoxygenase
Ligand
BDBM50041782
Substrate
Meas. Tech.
ChEMBL_3982 (CHEMBL619255)
IC50
1000±n/a nM
Citation
 Müller, KLeukel, PZiereis, KGawlik, I Antipsoriatic anthrones with modulated redox properties. 2. Novel derivatives of chrysarobin and isochrysarobin--antiproliferative activity and 5-lipoxygenase inhibition. J Med Chem 37:1660-9 (1994)  
Target
Name:
5-lipoxygenase
Synonyms:
Arachidonate 5-lipoxygenase
Type:
PROTEIN
Mol. Mass.:
49994.23
Organism:
Bos taurus
Description:
ChEMBL_157766
Residue:
430
  
Inhibitor
Name:
BDBM50041782
Synonyms:
3-(2,5-Dihydroxy-benzyl)-1,8-dihydroxy-10H-anthracen-9-one | CHEMBL433067
Type:
Small organic molecule
Emp. Form.:
C21H16O5
Mol. Mass.:
348.3487
SMILES:
Oc1ccc(O)c(Cc2cc(O)c3C(=O)c4c(O)cccc4Cc3c2)c1
: