Target
D(2) dopamine receptor
Ligand
BDBM50041961
Substrate
Meas. Tech.
ChEMBL_59485 (CHEMBL670137)
Ki
18±n/a nM
Citation
 Sonesson, CWaters, NSvensson, KCarlsson, ASmith, MWPiercey, MFMeier, EWikström, H Substituted 3-phenylpiperidines: new centrally acting dopamine autoreceptor antagonists. J Med Chem 36:3188-96 (1993)  
Target
Name:
D(2) dopamine receptor
Synonyms:
DOPAMINE D2 DRD2_BOVIN | Dopamine D2 receptor
Type:
Enzyme Catalytic Domain
Mol. Mass.:
50698.79
Organism:
BOVINE
Description:
P20288
Residue:
444
  
Inhibitor
Name:
BDBM50041961
Synonyms:
((1S,2R)-5-Methoxy-1-methyl-1,2,3,4-tetrahydro-naphthalen-2-yl)-dipropyl-amine (1S,2R)-(5-Methoxy-1-methyl-1,2,3,4-tetrahydro-naphthalen-2-yl)-dipropyl-amine CHEMBL278751 | UH-232
Type:
Small organic molecule
Emp. Form.:
C18H29NO
Mol. Mass.:
275.429
SMILES:
CCCN(CCC)[C@@H]1CCc2c(OC)cccc2[C@@H]1C
: