Target
D(2) dopamine receptor
Ligand
BDBM21398
Substrate
Meas. Tech.
ChEMBL_59485 (CHEMBL670137)
Ki
0.300000±n/a nM
Citation
 Sonesson, CWaters, NSvensson, KCarlsson, ASmith, MWPiercey, MFMeier, EWikström, H Substituted 3-phenylpiperidines: new centrally acting dopamine autoreceptor antagonists. J Med Chem 36:3188-96 (1993)  
Target
Name:
D(2) dopamine receptor
Synonyms:
DOPAMINE D2 DRD2_BOVIN | Dopamine D2 receptor
Type:
Enzyme Catalytic Domain
Mol. Mass.:
50698.79
Organism:
BOVINE
Description:
P20288
Residue:
444
  
Inhibitor
Name:
BDBM21398
Synonyms:
4-[4-(4-Chloro-phenyl)-4-hydroxy-piperidin-1-yl]-1-(4-fluoro-phenyl)-butan-1-one;propionate(HCl) CHEMBL54 Haloperidol | Haloperidol, 1
Type:
Small organic molecule
Emp. Form.:
C21H23ClFNO2
Mol. Mass.:
375.864
SMILES:
OC1(CCN(CCCC(=O)c2ccc(F)cc2)CC1)c1ccc(Cl)cc1
: