Target
Replicase polyprotein 1ab
Ligand
BDBM50495212
Substrate
Meas. Tech.
ChEMBL_1284696 (CHEMBL3107396)
IC50
>200000±n/a nM
Citation
 Lee, HMittal, APatel, KGatuz, JLTruong, LTorres, JMulhearn, DCJohnson, ME Identification of novel drug scaffolds for inhibition of SARS-CoV 3-Chymotrypsin-like protease using virtual and high-throughput screenings. Bioorg Med Chem 22:167-77 (2014)  
Target
Name:
Replicase polyprotein 1ab
Synonyms:
3C-like proteinase 3C-like proteinase (SARS-CoV 3Cpro) 3CLp GFL Guanine-N7 methyltransferase Helicase Leader protein Non-structural protein 10 Non-structural protein 3 Non-structural protein 6 Non-structural protein 8 ORF1ab polyprotein PL2-PRO Pol R1AB_SARS RdRp SARS coronavirus main proteinase nsp1 nsp12 nsp14 nsp16 nsp3 nsp5 nsp7 nsp9 pp1ab | rep
Type:
Protein
Mol. Mass.:
790250.81
Organism:
Human SARS coronavirus (SARS-CoV) (Severe acute respiratory syndrome coronavirus)
Description:
P0C6X7
Residue:
7073
  
Inhibitor
Name:
BDBM50495212
Synonyms:
CHEMBL1876821
Type:
Small organic molecule
Emp. Form.:
C14H19ClN2O3S
Mol. Mass.:
330.83
SMILES:
CN(CC(=O)NC1CCCC1)S(=O)(=O)c1cccc(Cl)c1
: