Target
Acyl-CoA:cholesterol acyltransferase
Ligand
BDBM50042104
Substrate
Meas. Tech.
ChEBML_28188
IC50
12±n/a nM
Citation
 Trivedi, BKHolmes, AStoeber, TLBlankley, CJRoark, WHPicard, JAShaw, MKEssenburg, ADStanfield, RLKrause, BR Inhibitors of acyl-Coa:cholesterol acyltransferase. 4. A novel series of urea ACAT inhibitors as potential hypocholesterolemic agents. J Med Chem 36:3300-7 (1993)  
Target
Name:
Acyl-CoA:cholesterol acyltransferase
Synonyms:
ACAT
Type:
Mol. Mass.:
35405.31
Organism:
Oryctolagus cuniculus
Description:
Residue:
305
  
Inhibitor
Name:
BDBM50042104
Synonyms:
1-(2,6-Diisopropyl-phenyl)-3-(1-thiophen-2-yl-cyclopentylmethyl)-urea | CHEMBL430887
Type:
Small organic molecule
Emp. Form.:
C23H32N2OS
Mol. Mass.:
384.578
SMILES:
CC(C)c1cccc(C(C)C)c1NC(=O)NCC1(CCCC1)c1cccs1
: