Target
Adenosine receptor A1
Ligand
BDBM50018152
Substrate
Meas. Tech.
ChEMBL_29009 (CHEMBL643483)
Ki
67±n/a nM
Citation
 Müller, CEShi, DManning, MDaly, JW Synthesis of paraxanthine analogs (1,7-disubstituted xanthines) and other xanthines unsubstituted at the 3-position: structure-activity relationships at adenosine receptors. J Med Chem 36:3341-9 (1993)  
Target
Name:
Adenosine receptor A1
Synonyms:
AA1R_RAT ADENOSINE A1 high Adenosine A1 receptor (A1) Adenosine receptors A1 | Adora1
Type:
Protein
Mol. Mass.:
36704.13
Organism:
Rattus norvegicus (rat)
Description:
Residue:
326
  
Inhibitor
Name:
BDBM50018152
Synonyms:
8-Phenyl-1-propyl-3,7-dihydro-purine-2,6-dione | CHEMBL274855
Type:
Small organic molecule
Emp. Form.:
C14H14N4O2
Mol. Mass.:
270.2866
SMILES:
CCCn1c(=O)[nH]c2nc([nH]c2c1=O)-c1ccccc1
: