Target
Thymidylate synthase
Ligand
BDBM50042375
Substrate
Meas. Tech.
ChEMBL_209654 (CHEMBL811594)
Ki
18±n/a nM
Citation
 Pendergast, WDickerson, SHJohnson, JVDev, IKFerone, RDuch, DSSmith, GK Benzoquinazoline inhibitors of thymidylate synthase: enzyme inhibitory activity and cytotoxicity of some sulfonamidobenzoylglutamate and related derivatives. J Med Chem 36:3464-71 (1993)  
Target
Name:
Thymidylate synthase
Synonyms:
TS TYMS Thymidylate synthase (TS) | Thymidylate synthase/GAR transformylase/AICAR transformylase
Type:
Enzyme
Mol. Mass.:
35718.07
Organism:
Homo sapiens (Human)
Description:
Residue:
313
  
Inhibitor
Name:
BDBM50042375
Synonyms:
2-[4-(3-Methyl-1-oxo-1,2,5,6-tetrahydro-benzo[f]quinazoline-9-sulfonylamino)-benzoylamino]-pentanedioic acid | CHEMBL324932
Type:
Small organic molecule
Emp. Form.:
C25H24N4O8S
Mol. Mass.:
540.545
SMILES:
Cc1nc2CCc3ccc(cc3-c2c(=O)[nH]1)S(=O)(=O)Nc1ccc(cc1)C(=O)N[C@@H](CCC(O)=O)C(O)=O
: