Target
Calpain small subunit 1/1 catalytic subunit
Ligand
BDBM50042436
Substrate
Meas. Tech.
ChEMBL_43671 (CHEMBL656204)
Ki
20000±n/a nM
Citation
 Li, ZPatil, GSGolubski, ZEHori, HTehrani, KForeman, JEEveleth, DDBartus, RTPowers, JC Peptide alpha-keto ester, alpha-keto amide, and alpha-keto acid inhibitors of calpains and other cysteine proteases. J Med Chem 36:3472-80 (1993)  
Target
Name:
Calpain small subunit 1/1 catalytic subunit
Synonyms:
Calpain 1 | Calpain 1/small subunit 1
Type:
Mol. Mass.:
Description:
ASSAY_ID of EBI is 43671
Components:
This complex has 2 components.
Component 1
Name:
Calpain small subunit 1
Synonyms:
CAPN4 CAPNS1 Calpain 1
Type:
PROTEIN
Mol. Mass.:
28309.36
Organism:
Homo sapiens (Human)
Description:
EBI_12682
Residue:
268
  
Component 2
Name:
Calpain-1 catalytic subunit
Synonyms:
CAN1_HUMAN CAPN1 Calpain-1 (u-Calpain) Calpain1
Type:
Protein
Mol. Mass.:
81880.51
Organism:
Homo sapiens (Human)
Description:
Residue:
714
  
Inhibitor
Name:
BDBM50042436
Synonyms:
3-[4-Methyl-2-(2-phenoxy-butyrylamino)-pentanoylamino]-2-oxo-pentanoic acid ethyl ester | CHEMBL331383
Type:
Small organic molecule
Emp. Form.:
C23H34N2O6
Mol. Mass.:
434.5259
SMILES:
CCOC(=O)C(=O)C(CC)NC(=O)C(CC(C)C)NC(=O)C(CC)Oc1ccccc1
: