Target
Transmembrane prolyl 4-hydroxylase
Ligand
BDBM50042875
Substrate
Meas. Tech.
ChEBML_223465
IC50
13200±n/a nM
Citation
 Hales, NJBeattie, JF Novel inhibitors of prolyl 4-hydroxylase. 5. The intriguing structure-activity relationships seen with 2,2'-bipyridine and its 5,5'-dicarboxylic acid derivatives. J Med Chem 36:3853-8 (1994)  
Target
Name:
Transmembrane prolyl 4-hydroxylase
Synonyms:
Hypoxia-inducible factor prolyl 4-hydroxylase Hypoxia-inducible factor prolyl hydroxylase 4 P4HTM PH4 | Transmembrane prolyl 4-hydroxylase
Type:
Enzyme
Mol. Mass.:
56654.25
Organism:
Homo sapiens (Human)
Description:
Q9NXG6
Residue:
502
  
Inhibitor
Name:
BDBM50042875
Synonyms:
CHEMBL125345 | Potassium; [2,2']bipyridinyl-5-carboxylate
Type:
Small organic molecule
Emp. Form.:
C11H7N2O2
Mol. Mass.:
199.186
SMILES:
[O-]C(=O)c1ccc(nc1)-c1ccccn1
: