Target
Type-2 angiotensin II receptor
Ligand
BDBM50043043
Substrate
Meas. Tech.
ChEBML_35286
IC50
600±n/a nM
Citation
 VanAtten, MKEnsinger, CLChiu, ATMcCall, DENguyen, TTWexler, RRTimmermans, PB A novel series of selective, non-peptide inhibitors of angiotensin II binding to the AT2 site. J Med Chem 36:3985-92 (1994)  
Target
Name:
Type-2 angiotensin II receptor
Synonyms:
AGTR2_RAT Agtr2 Angiotensin II receptor Type-2 angiotensin II receptor
Type:
Enzyme Catalytic Domain
Mol. Mass.:
41346.62
Organism:
RAT
Description:
Angiotensin II AT2 0 0::P35351
Residue:
363
  
Inhibitor
Name:
BDBM50043043
Synonyms:
2-Diphenylacetyl-6-hydroxy-1,2,3,4-tetrahydro-isoquinoline-3-carboxylic acid | CHEMBL340933
Type:
Small organic molecule
Emp. Form.:
C24H21NO4
Mol. Mass.:
387.4278
SMILES:
OC(=O)C1Cc2cc(O)ccc2CN1C(=O)C(c1ccccc1)c1ccccc1
: