Target
Oxytocin receptor
Ligand
BDBM50043114
Substrate
Meas. Tech.
ChEBML_145031
IC50
3.2±n/a nM
Citation
 Evans, BELundell, GFGilbert, KFBock, MGRittle, KECarroll, LAWilliams, PDPawluczyk, JMLeighton, JLYoung, MB Nanomolar-affinity, non-peptide oxytocin receptor antagonists. J Med Chem 36:3993-4005 (1994)  
Target
Name:
Oxytocin receptor
Synonyms:
OT-R Otr Oxytocin
Type:
Enzyme Catalytic Domain
Mol. Mass.:
42889.28
Organism:
RAT
Description:
Oxytocin OXTR RAT::P70536
Residue:
388
  
Inhibitor
Name:
BDBM50043114
Synonyms:
3-{1-[7,7-dimethyl-1-spiro[2,3-dihydro-1H-indene-1,4'-(hexahydropyridine)]-1-ylsulfonylmethyl-(1S,2S,4R)-bicyclo[2.2.1]hept-2-yl]-2,5-dioxotetrahydro-1H-4-imidazolyl}propanamide | CHEMBL433662
Type:
Small organic molecule
Emp. Form.:
C29H40N4O5S
Mol. Mass.:
556.717
SMILES:
CC1(C)[C@@H]2CC[C@@]1(CS(=O)(=O)N1CCC3(CCc4ccccc34)CC1)[C@H](C2)n1c(O)c(CCC(N)=O)[nH]c1=O
: