Target
Oxytocin receptor
Ligand
BDBM50043204
Substrate
Meas. Tech.
ChEBML_145031
IC50
8.3±n/a nM
Citation
 Evans, BELundell, GFGilbert, KFBock, MGRittle, KECarroll, LAWilliams, PDPawluczyk, JMLeighton, JLYoung, MB Nanomolar-affinity, non-peptide oxytocin receptor antagonists. J Med Chem 36:3993-4005 (1994)  
Target
Name:
Oxytocin receptor
Synonyms:
OT-R Otr Oxytocin
Type:
Enzyme Catalytic Domain
Mol. Mass.:
42889.28
Organism:
RAT
Description:
Oxytocin OXTR RAT::P70536
Residue:
388
  
Inhibitor
Name:
BDBM50043204
Synonyms:
1N-[2-hydroxy-7,7-dimethyl-1-spiro[1H-indene-1,4'-(hexahydropyridine)]-1-ylsulfonylmethyl-(1S,2R,4R)-bicyclo[2.2.1]hept-2-ylmethyl]-2-(1H-4-imidazolylmethylcarboxamido)-3-methyl-(2S)-butanamide | CHEMBL337889
Type:
Small organic molecule
Emp. Form.:
C34H47N5O5S
Mol. Mass.:
637.832
SMILES:
CC(C)[C@H](NC(=O)Cc1cnc[nH]1)C(=O)NC[C@@]1(O)C[C@H]2CC[C@]1(CS(=O)(=O)N1CCC3(CC1)C=Cc1ccccc31)C2(C)C
: