Target
Oxytocin receptor
Ligand
BDBM50043186
Substrate
Meas. Tech.
ChEBML_145031
IC50
1.2±n/a nM
Citation
 Evans, BELundell, GFGilbert, KFBock, MGRittle, KECarroll, LAWilliams, PDPawluczyk, JMLeighton, JLYoung, MB Nanomolar-affinity, non-peptide oxytocin receptor antagonists. J Med Chem 36:3993-4005 (1994)  
Target
Name:
Oxytocin receptor
Synonyms:
OT-R Otr Oxytocin
Type:
Enzyme Catalytic Domain
Mol. Mass.:
42889.28
Organism:
RAT
Description:
Oxytocin OXTR RAT::P70536
Residue:
388
  
Inhibitor
Name:
BDBM50043186
Synonyms:
1N-[7,7-dimethyl-1-spiro[2,3-dihydro-1H-indene-1,4'-(hexahydropyridine)]-1-ylsulfonylmethyl-(1S,2S,4R)-bicyclo[2.2.1]hept-2-yl]-2-(1H-4-imidazolylmethylcarboxamido)-4-methylsulfonylbutanamide | CHEMBL131477
Type:
Small organic molecule
Emp. Form.:
C33H47N5O6S2
Mol. Mass.:
673.886
SMILES:
CC1(C)[C@@H]2CC[C@@]1(CS(=O)(=O)N1CCC3(CCc4ccccc34)CC1)[C@H](C2)NC(=O)C(CCS(C)(=O)=O)NC(=O)Cc1cnc[nH]1
: