Target
Type-1 angiotensin II receptor B
Ligand
BDBM50043260
Substrate
Meas. Tech.
ChEMBL_34819 (CHEMBL648963)
IC50
3±n/a nM
Citation
 Ries, UJMihm, GNarr, BHasselbach, KMWittneben, HEntzeroth, Mvan Meel, JCWienen, WHauel, NH 6-Substituted benzimidazoles as new nonpeptide angiotensin II receptor antagonists: synthesis, biological activity, and structure-activity relationships. J Med Chem 36:4040-51 (1994)  
Target
Name:
Type-1 angiotensin II receptor B
Synonyms:
AGTRB_RAT Agtr1 Angiotensin II AT1B Angiotensin II type 1b (AT-1b) receptor Type-1B angiotensin II receptor
Type:
Enzyme Catalytic Domain
Mol. Mass.:
40929.44
Organism:
RAT
Description:
Angiotensin II AT1B 0 RAT::P29089
Residue:
359
  
Inhibitor
Name:
BDBM50043260
Synonyms:
2-Butyl-6-(1,1-dioxo-1lambda*6*-[1,2]thiazinan-2-yl)-1-[2'-(1H-tetrazol-5-yl)-biphenyl-4-ylmethyl]-1H-benzoimidazole | CHEMBL130095
Type:
Small organic molecule
Emp. Form.:
C29H31N7O2S
Mol. Mass.:
541.667
SMILES:
CCCCc1nc2ccc(cc2n1Cc1ccc(cc1)-c1ccccc1-c1nnn[nH]1)N1CCCCS1(=O)=O
: