Target
Dihydrofolate reductase
Ligand
BDBM50043396
Substrate
Meas. Tech.
ChEMBL_54605 (CHEMBL667327)
Ki
0.00455±n/a nM
Citation
 Piper, JRJohnson, CAMaddry, JAMalik, NDMcGuire, JJOtter, GMSirotnak, FM Studies on analogues of classical antifolates bearing the naphthoyl group in place of benzoyl in the side chain. J Med Chem 36:4161-71 (1994)  
Target
Name:
Dihydrofolate reductase
Synonyms:
DYR_MOUSE | Dhfr
Type:
Enzyme
Mol. Mass.:
21608.82
Organism:
Mus musculus (Mouse)
Description:
Residue:
187
  
Inhibitor
Name:
BDBM50043396
Synonyms:
2-({4-[(2,4-Diamino-pteridin-6-ylmethyl)-amino]-naphthalene-1-carbonyl}-amino)-pentanedioic acid | CHEMBL335716
Type:
Small organic molecule
Emp. Form.:
C23H22N8O5
Mol. Mass.:
490.4714
SMILES:
Nc1nc(N)c2nc(CNc3ccc(C(=O)NC(CCC(O)=O)C(O)=O)c4ccccc34)cnc2n1
: