Target
Thromboxane-A synthase
Ligand
BDBM50003776
Substrate
Meas. Tech.
ChEMBL_209417 (CHEMBL816624)
IC50
6.00±n/a nM
Citation
 Soyka, RHeckel, ANickl, JEisert, WMüller, THWeisenberger, H 6,6-Disubstituted Hex-5-enoic acid derivatives as combined thromboxane A2 receptor antagonists and synthetase inhibitors. J Med Chem 37:26-39 (1994)  
Target
Name:
Thromboxane-A synthase
Synonyms:
CYP5 Cytochrome P450 5A1 TBXAS1 TXA synthase TXS Thromboxane A2 Synthase (P450 TxA2) Thromboxane prostanoid Thromboxane-A synthase
Type:
Enzyme
Mol. Mass.:
60524.67
Organism:
Homo sapiens (Human)
Description:
P24557
Residue:
533
  
Inhibitor
Name:
BDBM50003776
Synonyms:
8-(4-Chloro-benzenesulfonylamino)-4-(3-pyridin-3-yl-propyl)-octanoic acid CHEMBL65414
Type:
Small organic molecule
Emp. Form.:
C22H29ClN2O4S
Mol. Mass.:
452.995
SMILES:
OC(=O)CCC(CCCCNS(=O)(=O)c1ccc(Cl)cc1)CCCc1cccnc1
: