Target
Thromboxane-A synthase
Ligand
BDBM50043855
Substrate
Meas. Tech.
ChEMBL_209417 (CHEMBL816624)
IC50
5±n/a nM
Citation
 Soyka, RHeckel, ANickl, JEisert, WMüller, THWeisenberger, H 6,6-Disubstituted Hex-5-enoic acid derivatives as combined thromboxane A2 receptor antagonists and synthetase inhibitors. J Med Chem 37:26-39 (1994)  
Target
Name:
Thromboxane-A synthase
Synonyms:
CYP5 Cytochrome P450 5A1 TBXAS1 TXA synthase TXS Thromboxane A2 Synthase (P450 TxA2) Thromboxane prostanoid Thromboxane-A synthase
Type:
Enzyme
Mol. Mass.:
60524.67
Organism:
Homo sapiens (Human)
Description:
P24557
Residue:
533
  
Inhibitor
Name:
BDBM50043855
Synonyms:
(E)-6-{4-[2-(3,4-Dimethoxy-benzenesulfonylamino)-ethyl]-phenyl}-6-pyridin-3-yl-hex-5-enoic acid | CHEMBL129635
Type:
Small organic molecule
Emp. Form.:
C27H30N2O6S
Mol. Mass.:
510.602
SMILES:
COc1ccc(cc1OC)S(=O)(=O)NCCc1ccc(cc1)C(=C/CCCC(O)=O)\c1cccnc1
: