Target
Histone-lysine N-methyltransferase SUV39H1
Ligand
BDBM50443019
Substrate
Meas. Tech.
ChEMBL_1299029 (CHEMBL3134894)
Ki
>50000±n/a nM
Citation
 Deng, LZhang, LYao, YWang, CRedell, MSDong, SSong, Y Synthesis, Activity and Metabolic Stability of Non-Ribose Containing Inhibitors of Histone Methyltransferase DOT1L. Medchemcomm 4:822-826 (2013)  
Target
Name:
Histone-lysine N-methyltransferase SUV39H1
Synonyms:
H3-K9-HMTase 1 KMT1A Position-effect variegation 3-9 homolog SUV39H1 Su(var)3-9 homolog 1 | Suppressor of variegation 3-9 homolog 1
Type:
PROTEIN
Mol. Mass.:
47917.07
Organism:
Homo sapiens (Human)
Description:
ChEMBL_1473655
Residue:
412
  
Inhibitor
Name:
BDBM50443019
Synonyms:
CHEMBL3087502
Type:
Small organic molecule
Emp. Form.:
C28H40N8O3
Mol. Mass.:
536.669
SMILES:
CC(C)N(CCCNC(=O)Nc1ccc(cc1)C(C)(C)C)CC1=C[C@H]([C@H](O)[C@@H]1O)n1cnc2c(N)ncnc12
: