Target
Mu-type opioid receptor
Ligand
BDBM50159172
Substrate
Meas. Tech.
ChEMBL_1330171 (CHEMBL3224073)
Ki
>10000±n/a nM
Citation
 Prevatt-Smith, KMLovell, KMSimpson, DSDay, VWDouglas, JTBosch, PDersch, CMRothman, RBKivell, BPrisinzano, TE Potential Drug Abuse Therapeutics Derived from the Hallucinogenic Natural Product Salvinorin A. Medchemcomm 2:1217-1222 (2011)  
Target
Name:
Mu-type opioid receptor
Synonyms:
M-OR-1 MOR-1 MUOR1 Mu opiate receptor OPRM1 hMOP | mu-type opioid receptor isoform MOR-1
Type:
G Protein-Coupled Receptor (GPCR)
Mol. Mass.:
44789.51
Organism:
Homo sapiens (Human)
Description:
P35372
Residue:
400
  
Inhibitor
Name:
BDBM50159172
Synonyms:
(3S,4aR,4bS,6S,8R,8aR,10aR)-6-Formyloxy-3-furan-3-yl-4a,8a-dimethyl-1,5-dioxo-dodecahydro-2-oxa-phenanthrene-8-carboxylic acid methyl ester | CHEMBL370680
Type:
Small organic molecule
Emp. Form.:
C22H26O8
Mol. Mass.:
418.437
SMILES:
COC(=O)[C@@H]1C[C@H](OC=O)C(=O)[C@H]2[C@@]1(C)CC[C@H]1C(=O)O[C@@H](C[C@]21C)c1ccoc1
: