Target
5-hydroxytryptamine receptor 1A
Ligand
BDBM21393
Substrate
Meas. Tech.
ChEMBL_901 (CHEMBL615812)
Ki
0.500000±n/a nM
Citation
 Lin, CHHaadsma-Svensson, SRPhillips, GMcCall, RBPiercey, MFSmith, MWSvensson, KCarlsson, AChidester, CGVon Voigtlander, PF Synthesis and biological activity of cis-(3aR)-(-)-2,3,3a,4,5,9b-hexahydro- 3-propyl-1H-benz[e]indole-9-carboxamide: a potent and selective 5-HT1A receptor agonist with good oral availability. J Med Chem 36:2208-18 (1993)  
Target
Name:
5-hydroxytryptamine receptor 1A
Synonyms:
5-HT-1A 5-hydroxytryptamine receptor 1A (5-HT-1A) ADRB2RL1 Dopamine D2 receptor and serotonin 1a receptor HTR1A | Serotonin receptor 1A
Type:
Mol. Mass.:
46122.49
Organism:
Homo sapiens (Human)
Description:
Residue:
422
  
Inhibitor
Name:
BDBM21393
Synonyms:
7-(dipropylamino)-5,6,7,8-tetrahydronaphthalen-1-ol 8-OH-DPAT 8-OH-DPAT,(-) CHEMBL1788118 CHEMBL56 US10562853, Compound 8-OH-DPAT cid_1220
Type:
radiolabeled ligand
Emp. Form.:
C16H25NO
Mol. Mass.:
247.3758
SMILES:
CCCN(CCC)C1CCc2cccc(O)c2C1
: