Target
Steroid 17-alpha-hydroxylase/17,20 lyase
Ligand
BDBM50044424
Substrate
Meas. Tech.
ChEMBL_158900 (CHEMBL760887)
Ki
447±n/a nM
Citation
 Walker, KAKertesz, DJRotstein, DMSwinney, DCBerry, PWSo, OYWebb, ASWatson, DMMak, AYBurton, PM Selective inhibition of mammalian lanosterol 14 alpha-demethylase: a possible strategy for cholesterol lowering. J Med Chem 36:2235-7 (1993)  
Target
Name:
Steroid 17-alpha-hydroxylase/17,20 lyase
Synonyms:
CP17A_HUMAN CYP17A1 Cytochrome P450 17A1 Cytochrome P450 C17 (CYP17) Cytochrome P450-C17 P450-C17 Steroid 17-alpha-Monooxygenase (CYP17) Steroid 17-alpha-monooxygenase | cytochrome P450 monooxygenase 17 alpha hydroxylase/17,20-lyase (CYP17)
Type:
Enzyme
Mol. Mass.:
57382.42
Organism:
Homo sapiens (Human)
Description:
E.coli expressing human CYP17
Residue:
508
  
Inhibitor
Name:
BDBM50044424
Synonyms:
4-(((2S,4S)-2-((1H-imidazol-1-yl)methyl)-2-(4-chlorophenethyl)-1,3-dioxolan-4-yl)methylthio)benzenamine 4-{2-[2-(4-Chloro-phenyl)-ethyl]-2-imidazol-1-ylmethyl-[1,3]dioxolan-4-ylmethylsulfanyl}-phenylamine CHEMBL70611
Type:
Small organic molecule
Emp. Form.:
C22H24ClN3O2S
Mol. Mass.:
429.963
SMILES:
Nc1ccc(SC[C@@H]2CO[C@](CCc3ccc(Cl)cc3)(Cn3ccnc3)O2)cc1
: