Target
Serine/threonine-protein kinase B-raf
Ligand
BDBM50496952
Substrate
Meas. Tech.
ChEMBL_1337752 (CHEMBL3240201)
IC50
11±n/a nM
Citation
 Wenglowsky, SRen, LGrina, JHansen, JDLaird, ERMoreno, DDinkel, VGloor, SLHastings, GRana, SRasor, KSturgis, HLVoegtli, WCVigers, GWillis, BMathieu, SRudolph, J Highly potent and selective 3-N-methylquinazoline-4(3H)-one based inhibitors of B-Raf(V600E) kinase. Bioorg Med Chem Lett 24:1923-7 (2014)  
Target
Name:
Serine/threonine-protein kinase B-raf
Synonyms:
B-RAF B-Raf proto-oncogene serine/threonine-protein kinase BRAF1 RAFB1 v-Raf murine sarcoma viral oncogene homolog B1
Type:
Serine/threonine-protein kinase
Mol. Mass.:
84446.00
Organism:
Homo sapiens (Human)
Description:
P15056
Residue:
766
  
Inhibitor
Name:
BDBM50496952
Synonyms:
CHEMBL3236466
Type:
Small organic molecule
Emp. Form.:
C19H20F2N4O3S
Mol. Mass.:
422.449
SMILES:
CCCS(=O)(=O)Nc1ccc(F)c(N(C)c2ccc3ncn(C)c(=O)c3c2)c1F
: