Target
Sensory histidine kinase DcuS
Ligand
BDBM50497020
Substrate
Meas. Tech.
ChEMBL_1335394 (CHEMBL3239045)
Kd
4000±n/a nM
Citation
 Murray, EJCrowley, RCTruman, AClarke, SRCottam, JAJadhav, GPSteele, VRO'Shea, PLindholm, CCockayne, AChhabra, SRChan, WCWilliams, P Targeting Staphylococcus aureus quorum sensing with nonpeptidic small molecule inhibitors. J Med Chem 57:2813-9 (2014)  
Target
Name:
Sensory histidine kinase DcuS
Synonyms:
Receptor-histidine kinase AgrC
Type:
PROTEIN
Mol. Mass.:
49890.25
Organism:
Staphylococcus aureus
Description:
ChEMBL_305973
Residue:
430
  
Inhibitor
Name:
BDBM50497020
Synonyms:
CHEMBL3235590
Type:
Small organic molecule
Emp. Form.:
C18H30O4
Mol. Mass.:
310.4284
SMILES:
CCCCCCCCCCCCCC(=O)C1=C(O)COC1=O
: