Target
Cytochrome b-245 heavy chain
Ligand
BDBM50497261
Substrate
Meas. Tech.
ChEMBL_1390858 (CHEMBL3391326)
IC50
68000±n/a nM
Citation
 Cifuentes-Pagano, ESaha, JCsányi, GGhouleh, IASahoo, SRodríguez, AWipf, PPagano, PJSkoda, EM Bridged tetrahydroisoquinolines as selective NADPH oxidase 2 (Nox2) inhibitors. Medchemcomm 4:1085-1092 (2013)  
Target
Name:
Cytochrome b-245 heavy chain
Synonyms:
CGD91-phox CYBB Cytochrome b-245, beta polypeptide [Homo sapiens] Heme-binding membrane glycoprotein gp91phox NADPH oxidase 2 (NOX2) Neutrophil cytochrome b 91 kDa polypeptide gp91-1 p22 phagocyte B-cytochrome
Type:
Enzyme
Mol. Mass.:
65355.82
Organism:
Homo sapiens (Human)
Description:
P04839
Residue:
570
  
Inhibitor
Name:
BDBM50497261
Synonyms:
CHEMBL3347549
Type:
Small organic molecule
Emp. Form.:
C24H27BrFN
Mol. Mass.:
428.38
SMILES:
[H][C@@]12CC(C)(C)[C@@]([H])([C@H](CC(C)=C)N1Cc1cccc(F)c1)c1c(Br)cccc21
: