Target
Cathepsin E
Ligand
BDBM50045285
Substrate
Meas. Tech.
ChEBML_45334
Ki
2.2±n/a nM
Citation
 Rao, CMScarborough, PEKay, JBatley, BRapundalo, SKlutchko, STaylor, MDLunney, EAHumblet, CCDunn, BM Specificity in the binding of inhibitors to the active site of human/primate aspartic proteinases: analysis of P2-P1-P1'-P2' variation. J Med Chem 36:2614-20 (1993)  
Target
Name:
Cathepsin E
Synonyms:
3.4.23.34 CTSE Cathepsin E form II
Type:
Enzyme
Mol. Mass.:
43298.99
Organism:
Homo sapiens (Human)
Description:
P14091
Residue:
396
  
Inhibitor
Name:
BDBM50045285
Synonyms:
2-[2-(Morpholine-4-sulfonylamino)-3-phenyl-propionylamino]-pent-4-enoic acid (1-cyclohexylmethyl-4-[1,3]dithian-2-yl-2,4-dihydroxy-butyl)-amide | CHEMBL87025
Type:
Small organic molecule
Emp. Form.:
C33H52N4O7S3
Mol. Mass.:
712.984
SMILES:
O[C@@H](C[C@H](O)C1SCCCS1)[C@H](CC1CCCCC1)NC(=O)[C@H](CC=C)NC(=O)[C@H](Cc1ccccc1)NS(=O)(=O)N1CCOCC1
: