Target
G protein-activated inward rectifier potassium channel 1
Ligand
BDBM50497418
Substrate
Meas. Tech.
ChEMBL_1443118 (CHEMBL3371678)
IC50
9600±n/a nM
Citation
 Wen, WWu, WWeaver, CDLindsley, CW Discovery of potent and selective GIRK1/2 modulators via 'molecular switches' within a series of 1-(3-cyclopropyl-1-phenyl-1H-pyrazol-5-yl)ureas. Bioorg Med Chem Lett 24:5102-6 (2014)  
Target
Name:
G protein-activated inward rectifier potassium channel 1
Synonyms:
GIRK-1 Inward rectifier K(+) channel Kir3.1 KCNJ3_HUMAN | Potassium channel, inwardly rectifying subfamily J member 3
Type:
PROTEIN
Mol. Mass.:
56610.74
Organism:
Homo sapiens (Human)
Description:
ChEMBL_107915
Residue:
501
  
Inhibitor
Name:
BDBM50497418
Synonyms:
CHEMBL3339112
Type:
Small organic molecule
Emp. Form.:
C21H19F3N4O2
Mol. Mass.:
416.3964
SMILES:
COc1ccccc1NC(=O)Nc1cc(nn1-c1ccccc1)C1(CC1)C(F)(F)F
: