Target
Leukotriene B4 receptor 1
Ligand
BDBM50001609
Substrate
Meas. Tech.
ChEMBL_99827 (CHEMBL709857)
Ki
2±n/a nM
Citation
 Daines, RAChambers, PAPendrak, IJakas, DRSarau, HMFoley, JJSchmidt, DBGriswold, DEMartin, LDTzimas, MN (E)-3-[[[[6-(2-carboxyethenyl)-5-[[8-(4- methoxyphenyl)octyl]oxy]-2-pyridinyl]-methyl]thio]methyl]benzoic acid: a novel high-affinity leukotriene B4 receptor antagonist. J Med Chem 36:2703-5 (1993)  
Target
Name:
Leukotriene B4 receptor 1
Synonyms:
BLT BLTR Chemoattractant receptor-like 1 GPR16 LTB4-R 1 Leukotriene B4 R1 Leukotriene B4 receptor 1 P2Y purinoceptor 7 | P2Y7
Type:
Enzyme Catalytic Domain
Mol. Mass.:
37582.68
Organism:
Homo sapiens (Human)
Description:
Q15722
Residue:
352
  
Inhibitor
Name:
BDBM50001609
Synonyms:
8-Benzyloxy-4-[(methyl-phenethyl-carbamoyl)-methyl]-naphthalene-2-carboxylic acid CHEMBL328712
Type:
Small organic molecule
Emp. Form.:
C29H27NO4
Mol. Mass.:
453.529
SMILES:
CN(CCc1ccccc1)C(=O)Cc1cc(cc2c(OCc3ccccc3)cccc12)C(O)=O
: