Target
Leukotriene B4 receptor 1
Ligand
BDBM50001610
Substrate
Meas. Tech.
ChEMBL_99663 (CHEMBL704429)
IC50
300±n/a nM
Citation
 Daines, RAChambers, PAPendrak, IJakas, DRSarau, HMFoley, JJSchmidt, DBGriswold, DEMartin, LDTzimas, MN (E)-3-[[[[6-(2-carboxyethenyl)-5-[[8-(4- methoxyphenyl)octyl]oxy]-2-pyridinyl]-methyl]thio]methyl]benzoic acid: a novel high-affinity leukotriene B4 receptor antagonist. J Med Chem 36:2703-5 (1993)  
Target
Name:
Leukotriene B4 receptor 1
Synonyms:
BLT BLTR Chemoattractant receptor-like 1 GPR16 LTB4-R 1 Leukotriene B4 R1 Leukotriene B4 receptor 1 P2Y purinoceptor 7 | P2Y7
Type:
Enzyme Catalytic Domain
Mol. Mass.:
37582.68
Organism:
Homo sapiens (Human)
Description:
Q15722
Residue:
352
  
Inhibitor
Name:
BDBM50001610
Synonyms:
7-[3-(4-Acetyl-3-methoxy-2-propyl-phenoxy)-propoxy]-8-propyl-chroman-2-carboxylic acid CGS 24115 SC-41930
Type:
Small organic molecule
Emp. Form.:
C28H36O7
Mol. Mass.:
484.5812
SMILES:
CCCc1c(OCCCOc2ccc3CCC(Oc3c2CCC)C(O)=O)ccc(C(C)=O)c1OC
: