Target
M1 family aminopeptidase
Ligand
BDBM50497551
Substrate
Meas. Tech.
ChEMBL_1438459 (CHEMBL3384271)
Ki
7.4±n/a nM
Citation
 Mistry, SNDrinkwater, NRuggeri, CSivaraman, KKLoganathan, SFletcher, SDrag, MPaiardini, AAvery, VMScammells, PJMcGowan, S Two-pronged attack: dual inhibition of Plasmodium falciparum M1 and M17 metalloaminopeptidases by a novel series of hydroxamic acid-based inhibitors. J Med Chem 57:9168-83 (2014)  
Target
Name:
M1 family aminopeptidase
Synonyms:
AMPN_PLAF7 Zinc aminopeptidase | m1-family aminopeptidase
Type:
PROTEIN
Mol. Mass.:
126072.31
Organism:
Plasmodium falciparum (isolate FcB1 / Columbia)
Description:
ChEMBL_735637
Residue:
1085
  
Inhibitor
Name:
BDBM50497551
Synonyms:
CHEMBL3359700
Type:
Small organic molecule
Emp. Form.:
C18H17N5O3
Mol. Mass.:
351.3593
SMILES:
Nc1ccc(cc1)C(=O)NC(C(=O)NO)c1ccc(cc1)-n1cccn1
: