Target
Mu-type opioid receptor
Ligand
BDBM50045776
Substrate
Meas. Tech.
ChEBML_220391
Ki
0.290000±n/a nM
Citation
 Mitch, CHLeander, JDMendelsohn, LGShaw, WNWong, DTCantrell, BEJohnson, BGReel, JKSnoddy, JDTakemori, AE 3,4-Dimethyl-4-(3-hydroxyphenyl)piperidines: opioid antagonists with potent anorectant activity. J Med Chem 36:2842-50 (1993)  
Target
Name:
Mu-type opioid receptor
Synonyms:
MOR-1 Mu-type opioid receptor (MOR) OPRM_RAT Opioid receptor B Ror-b
Type:
G Protein-Coupled Receptor (GPCR)
Mol. Mass.:
44503.11
Organism:
Rattus norvegicus (rat)
Description:
Competition binding assays were carried out using membrane preparations from transfected HN9.10 cells that constitutively expressed the mu opioid receptor.
Residue:
398
  
Inhibitor
Name:
BDBM50045776
Synonyms:
CHEMBL982 NALMEFENE ORF-11676 cid_5284594
Type:
Small organic molecule
Emp. Form.:
C21H25NO3
Mol. Mass.:
339.4281
SMILES:
Oc1ccc2C[C@H]3N(CC4CC4)CC[C@@]45[C@@H](Oc1c24)C(=C)CC[C@@]35O
: