Target
Cannabinoid receptor 1
Ligand
BDBM50045867
Substrate
Meas. Tech.
ChEBML_46288
IC50
>1000±n/a nM
Citation
 Kozikowski, APMa, DBrewer, JSun, SCosta, ERomeo, EGuidotti, A Chemistry, binding affinities, and behavioral properties of a new class of"antineophobic" mitochondrial DBI receptor complex (mDRC) ligands. J Med Chem 36:2908-20 (1993)  
Target
Name:
Cannabinoid receptor 1
Synonyms:
Brain-type cannabinoid receptor CB-R CNR1_RAT Cannabinoid receptor Cnr1 | Skr6
Type:
G Protein-Coupled Receptor (GPCR)
Mol. Mass.:
52856.55
Organism:
Rattus norvegicus (rat)
Description:
P20272
Residue:
473
  
Inhibitor
Name:
BDBM50045867
Synonyms:
CHEMBL316711 | N,N-Dibutyl-2-[2-(4-fluoro-phenyl)-1H-indol-3-yl]-acetamide
Type:
Small organic molecule
Emp. Form.:
C24H29FN2O
Mol. Mass.:
380.4983
SMILES:
CCCCN(CCCC)C(=O)Cc1c([nH]c2ccccc12)-c1ccc(F)cc1
: