Target
Translocator protein
Ligand
BDBM50045863
Substrate
Meas. Tech.
ChEBML_218704
Ki
15±n/a nM
Citation
 Kozikowski, APMa, DBrewer, JSun, SCosta, ERomeo, EGuidotti, A Chemistry, binding affinities, and behavioral properties of a new class of"antineophobic" mitochondrial DBI receptor complex (mDRC) ligands. J Med Chem 36:2908-20 (1993)  
Target
Name:
Translocator protein
Synonyms:
Benzodiazepine receptors; peripheral & central Mbr PBR Peripheral benzodiazepine receptor (PBR) TSPO_RAT | Tspo
Type:
Mitochondrion membrane protein
Mol. Mass.:
18945.84
Organism:
Rattus norvegicus (rat)
Description:
Competitive binding experiments were performed on rat kidney mitochondrial membranes.
Residue:
169
  
Inhibitor
Name:
BDBM50045863
Synonyms:
2-[2-(4-Fluoro-phenyl)-1H-indol-3-yl]-N,N-dipentyl-acetamide | CHEMBL318884
Type:
Small organic molecule
Emp. Form.:
C26H33FN2O
Mol. Mass.:
408.5514
SMILES:
CCCCCN(CCCCC)C(=O)Cc1c([nH]c2ccccc12)-c1ccc(F)cc1
: