Target
Neuronal acetylcholine receptor subunit beta-2
Ligand
BDBM50497828
Substrate
Meas. Tech.
ChEMBL_1451267 (CHEMBL3362770)
IC50
>300000±n/a nM
Citation
 Jepsen, THJensen, AALund, MHGlibstrup, EKristensen, JL Synthesis and Pharmacological Evaluation of DH?E Analogues as Neuronal Nicotinic Acetylcholine Receptor Antagonists. ACS Med Chem Lett 5:766-70 (2014)  
Target
Name:
Neuronal acetylcholine receptor subunit beta-2
Synonyms:
ACHB2_MOUSE | Chrnb2
Type:
PROTEIN
Mol. Mass.:
57114.19
Organism:
Mus musculus
Description:
ChEMBL_108396
Residue:
501
  
Inhibitor
Name:
BDBM50497828
Synonyms:
CHEMBL3318901
Type:
Small organic molecule
Emp. Form.:
C8H13NO
Mol. Mass.:
139.1949
SMILES:
[H][C@]12C[C@@H](O)CC=C1CCN2
: