Target
G protein-coupled receptor
Ligand
BDBM78940
Substrate
Meas. Tech.
ChEMBL_1456669 (CHEMBL3370504)
EC50
331±n/a nM
Citation
 Tschammer, N Allosteric modulation of the G protein-coupled US28 receptor of human cytomegalovirus: are the small-weight inverse agonist of US28 'camouflaged' agonists? Bioorg Med Chem Lett 24:3744-7 (2014)  
Target
Name:
G protein-coupled receptor
Synonyms:
G protein-coupled receptor | US28
Type:
PROTEIN
Mol. Mass.:
40950.37
Organism:
Human cytomegalovirus
Description:
ChEMBL_109734
Residue:
354
  
Inhibitor
Name:
BDBM78940
Synonyms:
METHIOTHEPIN Methiothepin mesylate salt cid_3039995 methanesulfonic acid;1-methyl-4-(3-methylsulfanyl-5,6-dihydrobenzo[b][1]benzothiepin-5-yl)piperazine | methanesulfonic acid;1-methyl-4-[3-(methylthio)-5,6-dihydrobenzo[b][1]benzothiepin-5-yl]piperazine
Type:
Small organic molecule
Emp. Form.:
C20H24N2S2
Mol. Mass.:
356.548
SMILES:
CSc1ccc2Sc3ccccc3CC(N3CCN(C)CC3)c2c1
: