Target
S-adenosylmethionine decarboxylase proenzyme
Ligand
BDBM50046201
Substrate
Meas. Tech.
ChEBML_197689
IC50
1000±n/a nM
Citation
 Stanek, JCaravatti, GCapraro, HGFuret, PMett, HSchneider, PRegenass, U S-adenosylmethionine decarboxylase inhibitors: new aryl and heteroaryl analogues of methylglyoxal bis(guanylhydrazone). J Med Chem 36:46-54 (1993)  
Target
Name:
S-adenosylmethionine decarboxylase proenzyme
Synonyms:
Amd1 S-adenosylmethionine decarboxylase 1
Type:
PROTEIN
Mol. Mass.:
38134.93
Organism:
Rattus norvegicus
Description:
ChEMBL_197052
Residue:
333
  
Inhibitor
Name:
BDBM50046201
Synonyms:
(2E)-2-((2E)-2-{[(E)-amino(imino)methyl]hydrazono}-1-methylethylidene)hydrazinecarboximidamide CHEMBL216913 Mitoguazone methylglyoxalbisguanylhydrazone
Type:
Small organic molecule
Emp. Form.:
C5H12N8
Mol. Mass.:
184.2024
SMILES:
[#6]-[#6](-[#6]=[#7]-[#7]-[#6](-[#7])=[#7])=[#7]\[#7]=[#6](\[#7])-[#7]
: