Target
85/88 kDa calcium-independent phospholipase A2
Ligand
BDBM50046268
Substrate
Meas. Tech.
ChEMBL_156048 (CHEMBL760624)
IC50
>100±n/a nM
Citation
 Zupan, LAWeiss, RHHazen, SLParnas, BLAston, KWLennon, PJGetman, DPGross, RW Structural determinants of haloenol lactone-mediated suicide inhibition of canine myocardial calcium-independent phospholipase A2. J Med Chem 36:95-100 (1993)  
Target
Name:
85/88 kDa calcium-independent phospholipase A2
Synonyms:
Calcium-independent phospholipase A2 PLPL9_HUMAN | PLPLA9
Type:
PROTEIN
Mol. Mass.:
89913.62
Organism:
Homo sapiens (Human)
Description:
ChEMBL_156048
Residue:
806
  
Inhibitor
Name:
BDBM50046268
Synonyms:
6-Bromomethylene-3-naphthalen-1-yl-tetrahydro-pyran-2-one BTNP | CHEMBL6206
Type:
Small organic molecule
Emp. Form.:
C16H13BrO2
Mol. Mass.:
317.177
SMILES:
Br\C=C1/CCC(C(=O)O1)c1cccc2ccccc12
: