Target
Plasminogen
Ligand
BDBM50046368
Substrate
Meas. Tech.
ChEMBL_155411 (CHEMBL766113)
IC50
130±n/a nM
Citation
 Shuman, RTRothenberger, RBCampbell, CSSmith, GFGifford-Moore, DSGesellchen, PD Highly selective tripeptide thrombin inhibitors. J Med Chem 36:314-9 (1993)  
Target
Name:
Plasminogen
Synonyms:
Activation peptide PLG Plasmin Plasmin heavy chain A, short form | Plasmin light chain B
Type:
Enzyme
Mol. Mass.:
90579.18
Organism:
Homo sapiens (Human)
Description:
Residue:
810
  
Inhibitor
Name:
BDBM50046368
Synonyms:
CHEMBL320988 | [2-[2-(1-Formyl-4-guanidino-butylcarbamoyl)-pyrrolidin-1-yl]-2-oxo-1-(3-trifluoromethyl-phenyl)-ethyl]-carbamic acid tert-butyl ester
Type:
Small organic molecule
Emp. Form.:
C25H35F3N6O5
Mol. Mass.:
556.5778
SMILES:
CC(C)(C)OC(=O)NC(C(=O)N1CCC[C@H]1C(=O)NC(CCCNC(N)=N)C=O)c1cccc(c1)C(F)(F)F
: