Target
Coagulation factor X
Ligand
BDBM50046372
Substrate
Meas. Tech.
ChEMBL_48968 (CHEMBL661679)
IC50
98.0±n/a nM
Citation
 Shuman, RTRothenberger, RBCampbell, CSSmith, GFGifford-Moore, DSGesellchen, PD Highly selective tripeptide thrombin inhibitors. J Med Chem 36:314-9 (1993)  
Target
Name:
Coagulation factor X
Synonyms:
Activated coagulation factor X (FXa) Coagulation factor X precursor F10 Factor X heavy chain Factor Xa Stuart-Prower factor
Type:
Enzyme
Mol. Mass.:
54726.60
Organism:
Homo sapiens (Human)
Description:
Residue:
488
  
Inhibitor
Name:
BDBM50046372
Synonyms:
CHEMBL318998 | {2-[2-(1-Formyl-4-guanidino-butylcarbamoyl)-pyrrolidin-1-yl]-2-oxo-1-phenyl-ethyl}-carbamic acid tert-butyl ester
Type:
Small organic molecule
Emp. Form.:
C24H36N6O5
Mol. Mass.:
488.5798
SMILES:
[#6]C([#6])([#6])[#8]-[#6](=O)-[#7]-[#6@@H](-[#6](=O)-[#7]-1-[#6]-[#6]-[#6]-[#6@H]-1-[#6](=O)-[#7]-[#6@@H](-[#6]-[#6]-[#6]\[#7]=[#6](/[#7])-[#7])-[#6]=O)-c1ccccc1
: