Target
Thymidylate synthase
Ligand
BDBM50046657
Substrate
Meas. Tech.
ChEMBL_219324 (CHEMBL823517)
Ki
15±n/a nM
Citation
 Webber, SEBleckman, TMAttard, JDeal, JGKathardekar, VWelsh, KMWebber, SJanson, CAMatthews, DASmith, WW Design of thymidylate synthase inhibitors using protein crystal structures: the synthesis and biological evaluation of a novel class of 5-substituted quinazolinones. J Med Chem 36:733-46 (1993)  
Target
Name:
Thymidylate synthase
Synonyms:
TS TYMS Thymidylate synthase (TS) | Thymidylate synthase/GAR transformylase/AICAR transformylase
Type:
Enzyme
Mol. Mass.:
35718.07
Organism:
Homo sapiens (Human)
Description:
Residue:
313
  
Inhibitor
Name:
BDBM50046657
Synonyms:
2-Amino-6-methyl-5-(pyridin-4-ylsulfanyl)-3H-quinazolin-4-one | CHEMBL320775
Type:
Small organic molecule
Emp. Form.:
C14H12N4OS
Mol. Mass.:
284.336
SMILES:
Cc1ccc2nc(N)[nH]c(=O)c2c1Sc1ccncc1
: