Target
Coagulation factor VII/Tissue factor
Ligand
BDBM50038002
Substrate
Meas. Tech.
ChEMBL_1472450 (CHEMBL3420603)
Ki
240000±n/a nM
Citation
 Cheney, DLBozarth, JMMetzler, WJMorin, PEMueller, LNewitt, JANirschl, AHRendina, ARTamura, JKWei, AWen, XWurtz, NRSeiffert, DAWexler, RRPriestley, ES Discovery of novel P1 groups for coagulation factor VIIa inhibition using fragment-based screening. J Med Chem 58:2799-808 (2015)  
Target
Name:
Coagulation factor VII/Tissue factor
Synonyms:
Coagulation factor III/Factor VIIa (fVIIa) | Coagulation factor III/VII
Type:
Mol. Mass.:
Description:
ASSAY_ID of EBI is 69535
Components:
This complex has 2 components.
Component 1
Name:
Tissue factor
Synonyms:
CD_antigen=CD142 Coagulation factor VII/tissue factor TF Thromboplastin | Tissue factor
Type:
PROTEIN
Mol. Mass.:
33067.61
Organism:
Homo sapiens (Human)
Description:
ChEMBL_936735
Residue:
295
  
Component 2
Name:
Coagulation factor VII
Synonyms:
Eptacog alfa FA7_HUMAN Factor VIIa (fVIIa) SPCA serum prothrombin conversion accelerator
Type:
Enzyme
Mol. Mass.:
51599.89
Organism:
Homo sapiens (Human)
Description:
Residue:
466
  
Inhibitor
Name:
BDBM50038002
Synonyms:
Benzamidine (Protonated) CHEMBL537204 | benzamidine
Type:
Small organic molecule
Emp. Form.:
C7H8N2
Mol. Mass.:
120.1518
SMILES:
NC(=N)c1ccccc1
: