Target
Type-1 angiotensin II receptor
Ligand
BDBM50047114
Substrate
Meas. Tech.
ChEMBL_36780 (CHEMBL650301)
IC50
86±n/a nM
Citation
 Bradbury, RHAllott, CPDennis, MGirdwood, JAKenny, PWMajor, JSOldham, AARatcliffe, AHRivett, JERoberts, DA New nonpeptide angiotensin II receptor antagonists. 3. Synthesis, biological properties, and structure-activity relationships of 2-alkyl-4-(biphenylylmethoxy)pyridine derivatives. J Med Chem 36:1245-54 (1993)  
Target
Name:
Type-1 angiotensin II receptor
Synonyms:
AGTR1 AT1 | Angiotensin II type-1 receptor
Type:
PROTEIN
Mol. Mass.:
41004.19
Organism:
Cavia porcellus
Description:
ChEMBL_36783
Residue:
359
  
Inhibitor
Name:
BDBM50047114
Synonyms:
3-Methoxymethyl-2,6-dimethyl-4-[2'-(1H-tetrazol-5-yl)-biphenyl-4-ylmethoxy]-pyridine | CHEMBL283770
Type:
Small organic molecule
Emp. Form.:
C23H23N5O2
Mol. Mass.:
401.461
SMILES:
COCc1c(C)nc(C)cc1OCc1ccc(cc1)-c1ccccc1-c1nnn[nH]1
: