Target
Adenosine receptor A1
Ligand
BDBM50037429
Substrate
Meas. Tech.
ChEBML_29455
Ki
28200±n/a nM
Citation
 Jacobson, KAGallo-Rodriguez, CMelman, NFischer, BMaillard, Mvan Bergen, Avan Galen, PJKarton, Y Structure-activity relationships of 8-styrylxanthines as A2-selective adenosine antagonists. J Med Chem 36:1333-42 (1993)  
Target
Name:
Adenosine receptor A1
Synonyms:
AA1R_RAT ADENOSINE A1 high Adenosine A1 receptor (A1) Adenosine receptors A1 | Adora1
Type:
Protein
Mol. Mass.:
36704.13
Organism:
Rattus norvegicus (rat)
Description:
Residue:
326
  
Inhibitor
Name:
BDBM50037429
Synonyms:
8-(3-chlorostyryl)caffeine CHEMBL26138 cid_5353365
Type:
Small organic molecule
Emp. Form.:
C16H15ClN4O2
Mol. Mass.:
330.769
SMILES:
Cn1c(\C=C\c2cccc(Cl)c2)nc2n(C)c(=O)n(C)c(=O)c12
: