Target
Aromatase
Ligand
BDBM9460
Substrate
Meas. Tech.
ChEBML_50687
IC50
1900±n/a nM
Citation
 Furet, PBatzl, CBhatnagar, AFrancotte, ERihs, GLang, M Aromatase inhibitors: synthesis, biological activity, and binding mode of azole-type compounds. J Med Chem 36:1393-400 (1993)  
Target
Name:
Aromatase
Synonyms:
ARO1 CP19A_HUMAN CYP19 CYPXIX Cytochrome P450 19A1 Cytochrome P450-C19 (CYP19) FL cytokine receptor precursor | P-450AROM
Type:
Enzyme
Mol. Mass.:
57888.92
Organism:
Homo sapiens (Human)
Description:
P11511
Residue:
503
  
Inhibitor
Name:
BDBM9460
Synonyms:
3-(4-aminophenyl)-3-ethyl-piperidine-2,6-dione Aminoglutethimide AG, 4 Cytadren Elipten | aminoglutethimide (AG)
Type:
Small organic molecule
Emp. Form.:
C13H16N2O2
Mol. Mass.:
232.2783
SMILES:
CCC1(CCC(=O)NC1=O)c1ccc(N)cc1
: