Target
Thromboxane A2 receptor
Ligand
BDBM50047267
Substrate
Meas. Tech.
ChEBML_212937
Kd
112±n/a nM
Citation
 Misra, RNBrown, BRSher, PMPatel, MMHall, SEHan, WCBarrish, JCKocy, OHarris, DNGoldenberg, HJ Interphenylene 7-oxabicyclo[2.2.1]heptane oxazoles. Highly potent, selective, and long-acting thromboxane A2 receptor antagonists. J Med Chem 36:1401-17 (1993)  
Target
Name:
Thromboxane A2 receptor
Synonyms:
Prostanoid TP receptor TBXA2R Thromboxane Thromboxane Beta
Type:
Enyzme
Mol. Mass.:
37445.28
Organism:
Homo sapiens (Human)
Description:
P21731
Residue:
343
  
Inhibitor
Name:
BDBM50047267
Synonyms:
2-{3-[2-(3-Hydroxy-propyl)-benzyl]-7-oxa-bicyclo[2.2.1]hept-2-yl}-oxazole-4-carboxylic acid (4-cyclohexyl-butyl)-amide | CHEMBL282601
Type:
Small organic molecule
Emp. Form.:
C30H42N2O4
Mol. Mass.:
494.6655
SMILES:
OCCCc1ccccc1CC1C2CCC(O2)C1c1nc(co1)C(=O)NCCCCC1CCCCC1
: