Target
Thromboxane A2 receptor
Ligand
BDBM50047296
Substrate
Meas. Tech.
ChEBML_212937
Kd
2.9±n/a nM
Citation
 Misra, RNBrown, BRSher, PMPatel, MMHall, SEHan, WCBarrish, JCKocy, OHarris, DNGoldenberg, HJ Interphenylene 7-oxabicyclo[2.2.1]heptane oxazoles. Highly potent, selective, and long-acting thromboxane A2 receptor antagonists. J Med Chem 36:1401-17 (1993)  
Target
Name:
Thromboxane A2 receptor
Synonyms:
Prostanoid TP receptor TBXA2R Thromboxane Thromboxane Beta
Type:
Enyzme
Mol. Mass.:
37445.28
Organism:
Homo sapiens (Human)
Description:
P21731
Residue:
343
  
Inhibitor
Name:
BDBM50047296
Synonyms:
3-(2-{3-[4-(3,3-Dimethyl-butylcarbamoyl)-oxazol-2-yl]-7-oxa-bicyclo[2.2.1]hept-2-ylmethyl}-phenyl)-propionic acid | CHEMBL31850
Type:
Small organic molecule
Emp. Form.:
C26H34N2O5
Mol. Mass.:
454.5586
SMILES:
CC(C)(C)CCNC(=O)c1coc(n1)C1C2CCC(O2)C1Cc1ccccc1CCC(O)=O
: