Target
Lysine-specific demethylase 3A
Ligand
BDBM50498690
Substrate
Meas. Tech.
ChEMBL_1519857 (CHEMBL3624700)
IC50
25119±n/a nM
Citation
 England, KSTumber, AKrojer, TScozzafava, GNg, SSDaniel, MSzykowska, AChe, Kvon Delft, FBurgess-Brown, NAKawamura, ASchofield, CJBrennan, PE Optimisation of a triazolopyridine based histone demethylase inhibitor yields a potent and selective KDM2A (FBXL11) inhibitor. Medchemcomm 5:1879-1886 (2014)  
Target
Name:
Lysine-specific demethylase 3A
Synonyms:
JHDM2A JMJD1A Jumonji domain-containing protein 1A KDM3A_HUMAN Lysine-specific demethylase 3A (KDM3A) | TSGA
Type:
PROTEIN
Mol. Mass.:
147368.22
Organism:
Homo sapiens (Human)
Description:
Q9Y4C1
Residue:
1321
  
Inhibitor
Name:
BDBM50498690
Synonyms:
CHEMBL3621853
Type:
Small organic molecule
Emp. Form.:
C9H7KN4O2
Mol. Mass.:
242.2758
SMILES:
[K;v0+].[#6]-n1cc(nn1)-c1cc(ccn1)-[#6](-[#8-])=O
: