Target
Neuronal acetylcholine receptor subunit alpha-4/beta-4
Ligand
BDBM50275262
Substrate
Meas. Tech.
ChEMBL_1520445 (CHEMBL3624574)
Ki
150±n/a nM
Citation
 de la Fuente Revenga, MBalle, TJensen, AAFrĝlund, B Conformationally restrained carbamoylcholine homologues. Synthesis, pharmacology at neuronal nicotinic acetylcholine receptors and biostructural considerations. Eur J Med Chem 102:352-62 (2015)  
Target
Name:
Neuronal acetylcholine receptor subunit alpha-4/beta-4
Synonyms:
Neuronal acetylcholine receptor protein alpha-4/beta-4 subunit nAChR subtypes alpha4 beta4
Type:
Mol. Mass.:
Description:
ASSAY_ID of EBI is 144014
Components:
This complex has 2 components.
Component 1
Name:
Neuronal acetylcholine receptor subunit alpha-4
Synonyms:
ACHA4_RAT Cholinergic, Nicotinic Alpha4Beta2 Chrna4 Neuronal acetylcholine receptor (alpha4beta2 nAChR) Neuronal acetylcholine receptor subunit alpha 4 beta 2 | Neuronal acetylcholine receptor subunit alpha-4
Type:
Enzyme
Mol. Mass.:
70196.44
Organism:
Rattus norvegicus (Rat)
Description:
P09483
Residue:
630
  
Component 2
Name:
Neuronal acetylcholine receptor subunit beta-4
Synonyms:
ACHB4_RAT Chrnb4 Neuronal acetylcholine receptor non-alpha-2 chain | Neuronal acetylcholine receptor protein beta-4 subunit
Type:
Enzyme
Mol. Mass.:
55863.89
Organism:
Rattus norvegicus (Rat)
Description:
P12392
Residue:
495
  
Inhibitor
Name:
BDBM50275262
Synonyms:
3-(dimethylamino)butyl dimethylcarbamate CHEMBL486572
Type:
Small organic molecule
Emp. Form.:
C9H20N2O2
Mol. Mass.:
188.2673
SMILES:
CC(CCOC(=O)N(C)C)N(C)C
: