Target
Acyl-CoA:cholesterol acyltransferase
Ligand
BDBM50047560
Substrate
Meas. Tech.
ChEMBL_28334 (CHEMBL645898)
IC50
120±n/a nM
Citation
 Kimura, TWatanabe, NMatsui, MHayashi, KTanaka, HOhtsuka, ISaeki, TKogushi, MKabayashi, HAkasaka, K Structure-activity relationship of a series of phenylureas linked to 4-phenylimidazole. Novel potent inhibitors of acyl-CoA:cholesterol O-acyltransferase with antiatherosclerotic activity. 2. J Med Chem 36:1641-53 (1993)  
Target
Name:
Acyl-CoA:cholesterol acyltransferase
Synonyms:
ACAT
Type:
Mol. Mass.:
35405.31
Organism:
Oryctolagus cuniculus
Description:
Residue:
305
  
Inhibitor
Name:
BDBM50047560
Synonyms:
1-(2-{3-[4-(4-Chloro-phenyl)-imidazol-1-yl]-propoxy}-6-methyl-phenyl)-3-pentyl-urea | CHEMBL296714
Type:
Small organic molecule
Emp. Form.:
C25H31ClN4O2
Mol. Mass.:
454.992
SMILES:
CCCCCNC(=O)Nc1c(C)cccc1OCCCn1cnc(c1)-c1ccc(Cl)cc1
: