Target
Acyl-CoA:cholesterol acyltransferase
Ligand
BDBM50047588
Substrate
Meas. Tech.
ChEMBL_28334 (CHEMBL645898)
IC50
48±n/a nM
Citation
 Kimura, TWatanabe, NMatsui, MHayashi, KTanaka, HOhtsuka, ISaeki, TKogushi, MKabayashi, HAkasaka, K Structure-activity relationship of a series of phenylureas linked to 4-phenylimidazole. Novel potent inhibitors of acyl-CoA:cholesterol O-acyltransferase with antiatherosclerotic activity. 2. J Med Chem 36:1641-53 (1993)  
Target
Name:
Acyl-CoA:cholesterol acyltransferase
Synonyms:
ACAT
Type:
Mol. Mass.:
35405.31
Organism:
Oryctolagus cuniculus
Description:
Residue:
305
  
Inhibitor
Name:
BDBM50047588
Synonyms:
1-Butyl-3-{2-methyl-6-[3-(4-phenyl-imidazol-1-yl)-propoxy]-phenyl}-urea | CHEMBL43422
Type:
Small organic molecule
Emp. Form.:
C24H30N4O2
Mol. Mass.:
406.5206
SMILES:
CCCCNC(=O)Nc1c(C)cccc1OCCCn1cnc(c1)-c1ccccc1
: