Target
Acyl-CoA:cholesterol acyltransferase
Ligand
BDBM50047540
Substrate
Meas. Tech.
ChEMBL_28331 (CHEMBL645895)
IC50
310±n/a nM
Citation
 Kimura, TWatanabe, NMatsui, MHayashi, KTanaka, HOhtsuka, ISaeki, TKogushi, MKabayashi, HAkasaka, K Structure-activity relationship of a series of phenylureas linked to 4-phenylimidazole. Novel potent inhibitors of acyl-CoA:cholesterol O-acyltransferase with antiatherosclerotic activity. 2. J Med Chem 36:1641-53 (1993)  
Target
Name:
Acyl-CoA:cholesterol acyltransferase
Synonyms:
ACAT
Type:
Mol. Mass.:
35405.31
Organism:
Oryctolagus cuniculus
Description:
Residue:
305
  
Inhibitor
Name:
BDBM50047540
Synonyms:
1-{2-[3-(5-Dimethylaminomethyl-4-phenyl-imidazol-1-yl)-propoxy]-6-methyl-phenyl}-3-pentyl-urea | CHEMBL42873
Type:
Small organic molecule
Emp. Form.:
C28H39N5O2
Mol. Mass.:
477.6416
SMILES:
CCCCCNC(=O)Nc1c(C)cccc1OCCCn1cnc(c1CN(C)C)-c1ccccc1
: